Vlastní jádro

Přeji pěkný večer

Pokoušel jsem se podle návodu zapracovat na vlastním jádře, bohužel jsem byl zastaven poměrně v počátku.

Pokud postupuji podle návodu pracujícím s src.rpm, končím jakmile zadám
rpmbuild -bp --target=i386 /usr/src/redhat/SPECS/kernel.spec

končím u:

+ Arch=i386
+ make ARCH=i386 nonint_oldconfig
scripts/basic/fixdep.c:107:23: error: sys/types.h: No such file or directory
scripts/basic/fixdep.c:108:22: error: sys/stat.h: No such file or directory
scripts/basic/fixdep.c:109:22: error: sys/mman.h: No such file or directory
scripts/basic/fixdep.c:110:20: error: unistd.h: No such file or directory
scripts/basic/fixdep.c:111:19: error: fcntl.h: No such file or directory
scripts/basic/fixdep.c:112:20: error: string.h: No such file or directory
scripts/basic/fixdep.c:113:20: error: stdlib.h: No such file or directory
scripts/basic/fixdep.c:114:19: error: stdio.h: No such file or directory
In file included from /usr/lib/gcc/i386-redhat-linux/4.1.2/include/syslimits.h:7,
                 from /usr/lib/gcc/i386-redhat-linux/4.1.2/include/limits.h:11,
                 from scripts/basic/fixdep.c:115:
/usr/lib/gcc/i386-redhat-linux/4.1.2/include/limits.h:122:61: error: limits.h: No such file or directory
scripts/basic/fixdep.c:116:19: error: ctype.h: No such file or directory
scripts/basic/fixdep.c:117:23: error: arpa/inet.h: No such file or directory
scripts/basic/fixdep.c: In function 'usage':
scripts/basic/fixdep.c:131: warning: implicit declaration of function 'fprintf'
scripts/basic/fixdep.c:131: warning: incompatible implicit declaration of built-in function 'fprintf'
scripts/basic/fixdep.c:131: error: 'stderr' undeclared (first use in this function)
scripts/basic/fixdep.c:131: error: (Each undeclared identifier is reported only once
scripts/basic/fixdep.c:131: error: for each function it appears in.)
scripts/basic/fixdep.c:132: warning: implicit declaration of function 'exit'
scripts/basic/fixdep.c:132: warning: incompatible implicit declaration of built-in function 'exit'
scripts/basic/fixdep.c: In function 'print_cmdline':
scripts/basic/fixdep.c:140: warning: implicit declaration of function 'printf'
scripts/basic/fixdep.c:140: warning: incompatible implicit declaration of built-in function 'printf'
scripts/basic/fixdep.c: At top level:
scripts/basic/fixdep.c:143: error: 'NULL' undeclared here (not in a function)
scripts/basic/fixdep.c: In function 'grow_config':
scripts/basic/fixdep.c:156: warning: implicit declaration of function 'realloc'
scripts/basic/fixdep.c:156: warning: assignment makes pointer from integer without a cast
scripts/basic/fixdep.c:158: warning: implicit declaration of function 'perror'
scripts/basic/fixdep.c:158: warning: incompatible implicit declaration of built-in function 'exit'
scripts/basic/fixdep.c: In function 'is_defined_config':
scripts/basic/fixdep.c:174: warning: implicit declaration of function 'memcmp'
scripts/basic/fixdep.c: In function 'define_config':
scripts/basic/fixdep.c:187: warning: implicit declaration of function 'memcpy'
scripts/basic/fixdep.c:187: warning: incompatible implicit declaration of built-in function 'memcpy'
scripts/basic/fixdep.c: In function 'use_config':
scripts/basic/fixdep.c:206: error: 'PATH_MAX' undeclared (first use in this function)
scripts/basic/fixdep.c:214: warning: incompatible implicit declaration of built-in function 'memcpy'
scripts/basic/fixdep.c:220: warning: implicit declaration of function 'tolower'
scripts/basic/fixdep.c:222: warning: incompatible implicit declaration of built-in function 'printf'
scripts/basic/fixdep.c:206: warning: unused variable 's'
scripts/basic/fixdep.c: At top level:
scripts/basic/fixdep.c:225: error: expected declaration specifiers or '...' before 'size_t'
scripts/basic/fixdep.c: In function 'parse_config_file':
scripts/basic/fixdep.c:227: error: 'len' undeclared (first use in this function)
scripts/basic/fixdep.c:233: warning: implicit declaration of function 'ntohl'
scripts/basic/fixdep.c:244: warning: implicit declaration of function 'isalnum'
scripts/basic/fixdep.c: In function 'strrcmp':
scripts/basic/fixdep.c:261: warning: implicit declaration of function 'strlen'
scripts/basic/fixdep.c:261: warning: incompatible implicit declaration of built-in function 'strlen'
scripts/basic/fixdep.c: In function 'do_config_file':
scripts/basic/fixdep.c:272: error: storage size of 'st' isn't known
scripts/basic/fixdep.c:276: warning: implicit declaration of function 'open'
scripts/basic/fixdep.c:276: error: 'O_RDONLY' undeclared (first use in this function)
scripts/basic/fixdep.c:278: warning: incompatible implicit declaration of built-in function 'fprintf'
scripts/basic/fixdep.c:278: error: 'stderr' undeclared (first use in this function)
scripts/basic/fixdep.c:280: warning: incompatible implicit declaration of built-in function 'exit'
scripts/basic/fixdep.c:282: warning: implicit declaration of function 'fstat'
scripts/basic/fixdep.c:284: warning: implicit declaration of function 'close'
scripts/basic/fixdep.c:287: warning: implicit declaration of function 'mmap'
scripts/basic/fixdep.c:287: error: 'PROT_READ' undeclared (first use in this function)
scripts/basic/fixdep.c:287: error: 'MAP_PRIVATE' undeclared (first use in this function)
scripts/basic/fixdep.c:287: warning: assignment makes pointer from integer without a cast
scripts/basic/fixdep.c:294: error: too many arguments to function 'parse_config_file'
scripts/basic/fixdep.c:296: warning: implicit declaration of function 'munmap'
scripts/basic/fixdep.c:272: warning: unused variable 'st'
scripts/basic/fixdep.c: At top level:
scripts/basic/fixdep.c:301: error: expected declaration specifiers or '...' before 'size_t'
scripts/basic/fixdep.c: In function 'parse_dep_file':
scripts/basic/fixdep.c:304: error: 'len' undeclared (first use in this function)
scripts/basic/fixdep.c:306: error: 'PATH_MAX' undeclared (first use in this function)
scripts/basic/fixdep.c:308: warning: implicit declaration of function 'strchr'
scripts/basic/fixdep.c:308: warning: incompatible implicit declaration of built-in function 'strchr'
scripts/basic/fixdep.c:310: warning: incompatible implicit declaration of built-in function 'fprintf'
scripts/basic/fixdep.c:310: error: 'stderr' undeclared (first use in this function)
scripts/basic/fixdep.c:311: warning: incompatible implicit declaration of built-in function 'exit'
scripts/basic/fixdep.c:313: warning: incompatible implicit declaration of built-in function 'memcpy'
scripts/basic/fixdep.c:314: warning: incompatible implicit declaration of built-in function 'printf'
scripts/basic/fixdep.c:306: warning: unused variable 's'
scripts/basic/fixdep.c: In function 'print_deps':
scripts/basic/fixdep.c:343: error: storage size of 'st' isn't known
scripts/basic/fixdep.c:347: error: 'O_RDONLY' undeclared (first use in this function)
scripts/basic/fixdep.c:349: warning: incompatible implicit declaration of built-in function 'fprintf'
scripts/basic/fixdep.c:349: error: 'stderr' undeclared (first use in this function)
scripts/basic/fixdep.c:351: warning: incompatible implicit declaration of built-in function 'exit'
scripts/basic/fixdep.c:355: warning: incompatible implicit declaration of built-in function 'fprintf'
scripts/basic/fixdep.c:359: error: 'PROT_READ' undeclared (first use in this function)
scripts/basic/fixdep.c:359: error: 'MAP_PRIVATE' undeclared (first use in this function)
scripts/basic/fixdep.c:359: warning: assignment makes pointer from integer without a cast
scripts/basic/fixdep.c:366: error: too many arguments to function 'parse_dep_file'
scripts/basic/fixdep.c:343: warning: unused variable 'st'
scripts/basic/fixdep.c: In function 'traps':
scripts/basic/fixdep.c:378: warning: incompatible implicit declaration of built-in function 'fprintf'
scripts/basic/fixdep.c:378: error: 'stderr' undeclared (first use in this function)
scripts/basic/fixdep.c:380: warning: incompatible implicit declaration of built-in function 'exit'
make[1]: *** [scripts/basic/fixdep] Error 1
make: *** [scripts_basic] Error 2
error: Špatný návratový kód z /var/tmp/rpm-tmp.52550 (%prep)


chyby sestavení RPM:
    Špatný návratový kód z /var/tmp/rpm-tmp.52550 (%prep)

Pokud chci postupovat podle druhého způsobu-Jádro z www.kernel.org:
Je mi po zadání make menuconfig následující:


scripts/basic/fixdep.c:107:23: error: sys/types.h: není souborem ani adresářem
scripts/basic/fixdep.c:108:22: error: sys/stat.h: není souborem ani adresářem
scripts/basic/fixdep.c:109:22: error: sys/mman.h: není souborem ani adresářem
scripts/basic/fixdep.c:110:20: error: unistd.h: není souborem ani adresářem
scripts/basic/fixdep.c:111:19: error: fcntl.h: není souborem ani adresářem
scripts/basic/fixdep.c:112:20: error: string.h: není souborem ani adresářem
scripts/basic/fixdep.c:113:20: error: stdlib.h: není souborem ani adresářem
scripts/basic/fixdep.c:114:19: error: stdio.h: není souborem ani adresářem
In file included from /usr/lib/gcc/i386-redhat-linux/4.1.2/include/syslimits.h:7,
                 from /usr/lib/gcc/i386-redhat-linux/4.1.2/include/limits.h:11,
                 from scripts/basic/fixdep.c:115:
/usr/lib/gcc/i386-redhat-linux/4.1.2/include/limits.h:122:61: error: limits.h: není souborem ani adresářem
scripts/basic/fixdep.c:116:19: error: ctype.h: není souborem ani adresářem
scripts/basic/fixdep.c:117:23: error: arpa/inet.h: není souborem ani adresářem
scripts/basic/fixdep.c: In function ‘usage’:
scripts/basic/fixdep.c:131: warning: implicit declaration of function ‘fprintf’
scripts/basic/fixdep.c:131: warning: incompatible implicit declaration of built-in function ‘fprintf’
scripts/basic/fixdep.c:131: error: ‘stderr’ undeclared (first use in this function)
scripts/basic/fixdep.c:131: error: (Each undeclared identifier is reported only once
scripts/basic/fixdep.c:131: error: for each function it appears in.)
scripts/basic/fixdep.c:132: warning: implicit declaration of function ‘exit’
scripts/basic/fixdep.c:132: warning: incompatible implicit declaration of built-in function ‘exit’
scripts/basic/fixdep.c: In function ‘print_cmdline’:
scripts/basic/fixdep.c:140: warning: implicit declaration of function ‘printf’
scripts/basic/fixdep.c:140: warning: incompatible implicit declaration of built-in function ‘printf’
scripts/basic/fixdep.c: At top level:
scripts/basic/fixdep.c:143: error: ‘NULL’ undeclared here (not in a function)
scripts/basic/fixdep.c: In function ‘grow_config’:
scripts/basic/fixdep.c:156: warning: implicit declaration of function ‘realloc’
scripts/basic/fixdep.c:156: warning: assignment makes pointer from integer without a cast
scripts/basic/fixdep.c:158: warning: implicit declaration of function ‘perror’
scripts/basic/fixdep.c:158: warning: incompatible implicit declaration of built-in function ‘exit’
scripts/basic/fixdep.c: In function ‘is_defined_config’:
scripts/basic/fixdep.c:174: warning: implicit declaration of function ‘memcmp’
scripts/basic/fixdep.c: In function ‘define_config’:
scripts/basic/fixdep.c:187: warning: implicit declaration of function ‘memcpy’
scripts/basic/fixdep.c:187: warning: incompatible implicit declaration of built-in function ‘memcpy’
scripts/basic/fixdep.c: In function ‘use_config’:
scripts/basic/fixdep.c:206: error: ‘PATH_MAX’ undeclared (first use in this function)
scripts/basic/fixdep.c:214: warning: incompatible implicit declaration of built-in function ‘memcpy’
scripts/basic/fixdep.c:220: warning: implicit declaration of function ‘tolower’
scripts/basic/fixdep.c:222: warning: incompatible implicit declaration of built-in function ‘printf’
scripts/basic/fixdep.c:206: warning: unused variable ‘s’
scripts/basic/fixdep.c: At top level:
scripts/basic/fixdep.c:225: error: expected declaration specifiers or ‘...’ before ‘size_t’
scripts/basic/fixdep.c: In function ‘parse_config_file’:
scripts/basic/fixdep.c:227: error: ‘len’ undeclared (first use in this function)
scripts/basic/fixdep.c:233: warning: implicit declaration of function ‘ntohl’
scripts/basic/fixdep.c:244: warning: implicit declaration of function ‘isalnum’
scripts/basic/fixdep.c: In function ‘strrcmp’:
scripts/basic/fixdep.c:261: warning: implicit declaration of function ‘strlen’
scripts/basic/fixdep.c:261: warning: incompatible implicit declaration of built-in function ‘strlen’
scripts/basic/fixdep.c: In function ‘do_config_file’:
scripts/basic/fixdep.c:272: error: storage size of ‘st’ isn’t known
scripts/basic/fixdep.c:276: warning: implicit declaration of function ‘open’
scripts/basic/fixdep.c:276: error: ‘O_RDONLY’ undeclared (first use in this function)
scripts/basic/fixdep.c:278: warning: incompatible implicit declaration of built-in function ‘fprintf’
scripts/basic/fixdep.c:278: error: ‘stderr’ undeclared (first use in this function)
scripts/basic/fixdep.c:280: warning: incompatible implicit declaration of built-in function ‘exit’
scripts/basic/fixdep.c:282: warning: implicit declaration of function ‘fstat’
scripts/basic/fixdep.c:284: warning: implicit declaration of function ‘close’
scripts/basic/fixdep.c:287: warning: implicit declaration of function ‘mmap’
scripts/basic/fixdep.c:287: error: ‘PROT_READ’ undeclared (first use in this function)
scripts/basic/fixdep.c:287: error: ‘MAP_PRIVATE’ undeclared (first use in this function)
scripts/basic/fixdep.c:287: warning: assignment makes pointer from integer without a cast
scripts/basic/fixdep.c:294: error: too many arguments to function ‘parse_config_file’
scripts/basic/fixdep.c:296: warning: implicit declaration of function ‘munmap’
scripts/basic/fixdep.c:272: warning: unused variable ‘st’
scripts/basic/fixdep.c: At top level:
scripts/basic/fixdep.c:301: error: expected declaration specifiers or ‘...’ before ‘size_t’
scripts/basic/fixdep.c: In function ‘parse_dep_file’:
scripts/basic/fixdep.c:304: error: ‘len’ undeclared (first use in this function)
scripts/basic/fixdep.c:306: error: ‘PATH_MAX’ undeclared (first use in this function)
scripts/basic/fixdep.c:308: warning: implicit declaration of function ‘strchr’
scripts/basic/fixdep.c:308: warning: incompatible implicit declaration of built-in function ‘strchr’
scripts/basic/fixdep.c:310: warning: incompatible implicit declaration of built-in function ‘fprintf’
scripts/basic/fixdep.c:310: error: ‘stderr’ undeclared (first use in this function)
scripts/basic/fixdep.c:311: warning: incompatible implicit declaration of built-in function ‘exit’
scripts/basic/fixdep.c:313: warning: incompatible implicit declaration of built-in function ‘memcpy’
scripts/basic/fixdep.c:314: warning: incompatible implicit declaration of built-in function ‘printf’
scripts/basic/fixdep.c:306: warning: unused variable ‘s’
scripts/basic/fixdep.c: In function ‘print_deps’:
scripts/basic/fixdep.c:343: error: storage size of ‘st’ isn’t known
scripts/basic/fixdep.c:347: error: ‘O_RDONLY’ undeclared (first use in this function)
scripts/basic/fixdep.c:349: warning: incompatible implicit declaration of built-in function ‘fprintf’
scripts/basic/fixdep.c:349: error: ‘stderr’ undeclared (first use in this function)
scripts/basic/fixdep.c:351: warning: incompatible implicit declaration of built-in function ‘exit’
scripts/basic/fixdep.c:355: warning: incompatible implicit declaration of built-in function ‘fprintf’
scripts/basic/fixdep.c:359: error: ‘PROT_READ’ undeclared (first use in this function)
scripts/basic/fixdep.c:359: error: ‘MAP_PRIVATE’ undeclared (first use in this function)
scripts/basic/fixdep.c:359: warning: assignment makes pointer from integer without a cast
scripts/basic/fixdep.c:366: error: too many arguments to function ‘parse_dep_file’
scripts/basic/fixdep.c:343: warning: unused variable ‘st’
scripts/basic/fixdep.c: In function ‘traps’:
scripts/basic/fixdep.c:378: warning: incompatible implicit declaration of built-in function ‘fprintf’
scripts/basic/fixdep.c:378: error: ‘stderr’ undeclared (first use in this function)
scripts/basic/fixdep.c:380: warning: incompatible implicit declaration of built-in function ‘exit’
make[1]: *** [scripts/basic/fixdep] Error 1
make: *** [scripts_basic] Error 2

Omlouvám se za delší výpisy z konzole.

K tomu abyste mohl zkompilovat jadro, zrejme potrebujete dalsi -devel- baliky. Napr. glibc-devel atd. Tzn. mate nainstalovanou celou sekci Vyvojove nastroje?

Mám komplet nainstalováno Balíčky pro vývoj, GNOME vývoj i Javu a Fedora Eclipse, který z kompilací předpokládám nijak nesouvisí. Dále Starší aplikace a Vývojové nástroje. Všechny v defaultní konfiguraci po zakliknutí.

Bohužel výsledek je takový, jaký jsem zde vypsal.

locate sys/types.h
/usr/include/sys/types.h
rpm -qf /usr/include/sys/types.h
glibc-headers-2.7-2

Mate tento balik?

Opětovně zachráněn covexovou maličkostí. Velmi děkuji.

Chyběl mi skutečně tento balík (glibc-headers).

Zvlastni ze neni ve vyvojovych nastrojich… zkusime nahlasit jako chybu.

Takze glibc-headers jsou zavislosti glibc-devel. Pokud dam instalovat yum groupinstall “Development Libraries” musi se nainstalovat i glibc-headers. Neni mi tedy jasne jak mohlo dojit k tomu ze balik chybel…

yum groupinfo ‘Development Libraries’
Mandatory Packages:
zlib-devel
glibc-devel
readline-devel
ncurses-devel
bzip2-devel
pam-devel

Problem bude asi v tom, ze mame dve skupiny “Development Tools” a “Development Libraries” co?

Netuším kde mohl být problém. Na fedoře jsem kompilil jádro poprvní, jinak jsem zvyklej na gentoo, kde se mi natáhne vše automaticky z portage, pokud zkompuluji samotný gcc a glibc.